{"text_format":"1","workbook":"xlsx","n_sheets":4,"sheets":["Instructions","Time Tracking","Pay sheet","Deadlines"],"not_rendered":{"charts":0,"images":0,"macros":1,"external_links":0,"defined_names":5,"comments":0,"pivot_tables":0},"unopened":[],"bounds":{"document_bytes":16777216,"sheet_cells":100000,"rows_first":2000,"rows_last":500,"rows_between":2000,"halvings":0,"cell_chars":16384,"cell_head_chars":4096},"cells_cut":0,"cells_raw":0,"read":"whole","date_system":"1900"}

{"sheet":"Instructions","index":0,"n_rows":37,"n_cols":17,"rows_kept":37,"cut":false,"hidden":false,"merged":[]}
["Instructions"]
[]
["(1)","On Time Tracking sheet, enter employee name in cell D3."]
["(2)","On Time Tracking sheet, enter employee's department in cell Q3."]
["(3)","To enter time worked, list in/out times for the given day on the Time Tracking sheet rounded to the nearest 1/4 hour."]
[null,"For example:"]
[null,"On Monday, January 5, 2009 -"]
[null,"Employee started at 8:10 am."]
[null,"Employee left at 12:30 pm."]
[null,"Employee returned at 3:02 pm."]
[null,"Employee left for the day at 5:30 pm."]
[null,null,"Date","Day","In","Out","In","Out","In","Out"]
[null,"Yellow cells indicate where time would be entered:","2009-01-05","Monday","08:15:00","12:30:00","15:00:00","17:30:00"]
[]
[]
[null,"When entering time, you can either use the 24 hour clock or type \"A\" or \"P\" after the time to designate am/pm."]
[null,"For example:"]
[null,"3:30 PM can be entered as \"15:30\" or \"3:30 P\""]
[]
["(4)","If any sick/vacation/holiday time was taken during that day, enter the amount of hours in the appropriate column."]
[null,"For example:"]
[null,"On Monday, January 5, 2009 -"]
[null,"Employee started at 8:10 am"]
[null,"Employee left at 12:30 pm"]
[null,"Employee took 4 hours of vacation time.",null,null,null,null,null,null,null,null,"week"]
[null,null,"Date","Day","In","Out","In","Out","In","Out","Cumulative","ST","OT","Vac","Sick","Hol","Total Hrs"]
[null,"Yellow cells indicate where time would be entered:","2009-01-05","Monday","08:15:00","12:30:00",null,null,null,null,4.25,4.25,0,4,0,0,8.25]
[]
[]
["(5)","Use \"Comments\" section to indicate where employee was working if off-site."]
{"$rows_left_out":8}
{"sheet":"Time Tracking","index":1,"n_rows":740,"n_cols":20,"rows_kept":740,"cut":false,"hidden":false,"merged":[[6,3,6,8],[7,3,7,8]]}
["THE MOUNTAINEERS  "]
["Time Sheet - Non Exempt"]
["Name",null,null,"[enter name here]",null,null,null,null,null,null,null,null,null,null,null,"Dept","[enter department here]"]
[]
[]
[]
[null,null,null,"REGULAR HOURS"]
[null,null,null,"Enter time in nearest 1/4 hour segment (i.e., 8:00, 8:15, 8:30, 8:45)",null,null,null,null,null,null,null,"1/4 hrs","week","Regular"]
[null,"Date","Day","In","Out","In","Out","In","Out","Hrs wk'd",null,"worked","Cumulative","Time","Overtime","Sick","Vac","Hol","Total Hrs","Comments"]
[null,"2014-12-26","Friday",null,null,null,null,null,null,{"$f":"HOUR(I10-H10+G10-F10+E10-D10)","v":0},{"$f":"MINUTE(I10-H10+G10-F10+E10-D10)","v":0},{"$f":"IF(K10=15,0.25,IF(K10=30,0.5,IF(K10=45,0.75,0)))","v":0},null,null,null,null,null,null,{"$f":"SUM(N10:R10)","v":0}]
[null,"2014-12-27","Saturday",null,null,null,null,null,null,0,0,0,{"$f":"+M10+J11+L11","v":0},{"$f":"IF(M11>=40,40-SUM(N10:N10),M11-SUM(N10:N10))","v":0},{"$f":"+J11+L11-N11","v":0},null,null,null,0]
[null,"2014-12-28","Sunday",null,null,null,null,null,null,0,0,0,{"$f":"+J12+L12","v":0},{"$f":"IF(M12>=40,40,M12)","v":0},0,null,null,null,0]
[null,"2014-12-29","Monday",null,null,null,null,null,null,0,0,0,{"$f":"+M12+J13+L13","v":0},{"$f":"IF(M13>=40,40-N12,M13-N12)","v":0},0,null,null,null,{"$f":"SUM(N13:R13)","v":0}]
[null,"2014-12-30","Tuesday",null,null,null,null,null,null,0,0,0,0,{"$f":"IF(M14>=40,40-SUM(N12:N13),M14-SUM(N12:N13))","v":0},0,null,null,null,{"$f":"SUM(N14:R14)","v":0}]
[null,"2014-12-31","Wednesday",null,null,null,null,null,null,0,0,0,0,{"$f":"IF(M15>=40,40-SUM(N12:N14),M15-SUM(N12:N14))","v":0},0,null,null,null,{"$f":"SUM(N15:R15)","v":0}]
[null,"2015-01-01","Thursday",null,null,null,null,null,null,0,0,0,0,{"$f":"IF(M16>=40,40-SUM(N12:N15),M16-SUM(N12:N15))","v":0},0,null,null,null,0]
[null,"2015-01-02","Friday",null,null,null,null,null,null,0,0,0,0,{"$f":"IF(M17>=40,40-SUM(N12:N16),M17-SUM(N12:N16))","v":0},0,null,null,null,0]
[null,"2015-01-03","Saturday",null,null,null,null,null,null,0,0,0,0,{"$f":"IF(M18>=40,40-SUM(N12:N17),M18-SUM(N12:N17))","v":0},0,null,null,null,0]
[null,"2015-01-04","Sunday",null,null,null,null,null,null,0,0,0,{"$f":"+J19+L19","v":0},{"$f":"IF(M19>=40,40,M19)","v":0},0,null,null,null,0]
[null,"2015-01-05","Monday",null,null,null,null,null,null,0,0,0,{"$f":"+M19+J20+L20","v":0},{"$f":"IF(M20>=40,40-N19,M20-N19)","v":0},0,null,null,null,{"$f":"SUM(N20:R20)","v":0}]
[null,"2015-01-06","Tuesday",null,null,null,null,null,null,0,0,0,0,{"$f":"IF(M21>=40,40-SUM(N19:N20),M21-SUM(N19:N20))","v":0},0,null,null,null,{"$f":"SUM(N21:R21)","v":0}]
[null,"2015-01-07","Wednesday",null,null,null,null,null,null,0,0,0,0,{"$f":"IF(M22>=40,40-SUM(N19:N21),M22-SUM(N19:N21))","v":0},0,null,null,null,0]
[null,"2015-01-08","Thursday",null,null,null,null,null,null,0,0,0,0,{"$f":"IF(M23>=40,40-SUM(N19:N22),M23-SUM(N19:N22))","v":0},0,null,null,null,0]
[null,"2015-01-09","Friday",null,null,null,null,null,null,0,0,0,0,{"$f":"IF(M24>=40,40-SUM(N19:N23),M24-SUM(N19:N23))","v":0},0,null,null,null,0]
[null,"2015-01-10","Saturday",null,null,null,null,null,null,0,0,0,0,{"$f":"IF(M25>=40,40-SUM(N19:N24),M25-SUM(N19:N24))","v":0},0,null,null,null,0]
[null,"2015-01-11","Sunday",null,null,null,null,null,null,0,0,0,{"$f":"+J26+L26","v":0},{"$f":"IF(M26>=40,40,M26)","v":0},0,null,null,null,0]
[null,"2015-01-12","Monday",null,null,null,null,null,null,0,0,0,{"$f":"+M26+J27+L27","v":0},{"$f":"IF(M27>=40,40-N26,M27-N26)","v":0},0,null,null,null,{"$f":"SUM(N27:R27)","v":0}]
[null,"2015-01-13","Tuesday",null,null,null,null,null,null,0,0,0,0,{"$f":"IF(M28>=40,40-SUM(N26:N27),M28-SUM(N26:N27))","v":0},0,null,null,null,{"$f":"SUM(N28:R28)","v":0}]
[null,"2015-01-14","Wednesday",null,null,null,null,null,null,0,0,0,0,{"$f":"IF(M29>=40,40-SUM(N26:N28),M29-SUM(N26:N28))","v":0},0,null,null,null,{"$f":"SUM(N29:R29)","v":0}]
[null,"2015-01-15","Thursday",null,null,null,null,null,null,0,0,0,0,{"$f":"IF(M30>=40,40-SUM(N26:N29),M30-SUM(N26:N29))","v":0},0,null,null,null,0]
{"$rows_left_out":711}
{"sheet":"Pay sheet","index":2,"n_rows":35,"n_cols":15,"rows_kept":35,"cut":false,"hidden":false,"merged":[[7,2,7,7],[28,12,28,13]]}
["THE MOUNTAINEERS  "]
["Time Sheet - Non Exempt"]
[]
["Name",null,{"$f":"+'Time Tracking'!D3","v":"[enter name here]"},null,null,null,null,null,null,null,"Dept",{"$f":"+'Time Tracking'!Q3","v":"[enter department here]"}]
[]
["Pay period",null,"2015-03-11","to","2015-03-25"]
[]
[null,null,"REGULAR HOURS"]
["Day","Date","In","Out","In","Out","In","Out","ST","OT","Sick","Vac","Hol","Total Hrs","Comments"]
[{"$f":"VLOOKUP(B10,'Time Tracking'!$B$10:$C$19270,2)","v":"Wednesday"},{"$f":"+C6","v":"2015-03-11"},{"$f":"VLOOKUP($B10,'Time Tracking'!$B$10:$T$19270,3,FALSE)","v":"00:00:00"},{"$f":"VLOOKUP($B10,'Time Tracking'!$B$10:$T$19270,4,FALSE)","v":"00:00:00"},{"$f":"VLOOKUP($B10,'Time Tracking'!$B$10:$T$19270,5)","v":"00:00:00"},{"$f":"VLOOKUP($B10,'Time Tracking'!$B$10:$T$19270,6,FALSE)","v":"00:00:00"},{"$f":"VLOOKUP($B10,'Time Tracking'!$B$10:$T$19270,7,FALSE)","v":"00:00:00"},{"$f":"VLOOKUP($B10,'Time Tracking'!$B$10:$T$19270,8,FALSE)","v":"00:00:00"},{"$f":"VLOOKUP($B10,'Time Tracking'!$B$10:$T$19270,13,FALSE)","v":0},{"$f":"VLOOKUP($B10,'Time Tracking'!$B$10:$T$19270,14,FALSE)","v":0},{"$f":"VLOOKUP($B10,'Time Tracking'!$B$10:$T$19270,15,FALSE)","v":0},{"$f":"VLOOKUP($B10,'Time Tracking'!$B$10:$T$19270,16,FALSE)","v":0},{"$f":"VLOOKUP($B10,'Time Tracking'!$B$10:$T$19270,17,FALSE)","v":0},{"$f":"VLOOKUP($B10,'Time Tracking'!$B$10:$T$19270,18,FALSE)","v":0}]
[{"$f":"VLOOKUP(B11,'Time Tracking'!$B$10:$C$19270,2)","v":"Thursday"},{"$f":"1+B10","v":"2015-03-12"},{"$f":"VLOOKUP($B11,'Time Tracking'!$B$10:$T$19270,3,FALSE)","v":"00:00:00"},{"$f":"VLOOKUP($B11,'Time Tracking'!$B$10:$T$19270,4,FALSE)","v":"00:00:00"},{"$f":"LOOKUP($B11,'Time Tracking'!$B$10:$B$19270,'Time Tracking'!$F$10:$F$19270)","v":"00:00:00"},{"$f":"VLOOKUP($B11,'Time Tracking'!$B$10:$T$19270,6,FALSE)","v":"00:00:00"},{"$f":"VLOOKUP($B11,'Time Tracking'!$B$10:$T$19270,7,FALSE)","v":"00:00:00"},{"$f":"VLOOKUP($B11,'Time Tracking'!$B$10:$T$19270,8,FALSE)","v":"00:00:00"},{"$f":"VLOOKUP($B11,'Time Tracking'!$B$10:$T$19270,13,FALSE)","v":0},{"$f":"VLOOKUP($B11,'Time Tracking'!$B$10:$T$19270,14,FALSE)","v":0},{"$f":"VLOOKUP($B11,'Time Tracking'!$B$10:$T$19270,15,FALSE)","v":0},{"$f":"VLOOKUP($B11,'Time Tracking'!$B$10:$T$19270,16,FALSE)","v":0},{"$f":"VLOOKUP($B11,'Time Tracking'!$B$10:$T$19270,17,FALSE)","v":0},{"$f":"VLOOKUP($B11,'Time Tracking'!$B$10:$T$19270,18,FALSE)","v":0}]
[{"$f":"VLOOKUP(B12,'Time Tracking'!$B$10:$C$19270,2)","v":"Friday"},{"$f":"1+B11","v":"2015-03-13"},{"$f":"VLOOKUP($B12,'Time Tracking'!$B$10:$T$19270,3,FALSE)","v":"00:00:00"},{"$f":"VLOOKUP($B12,'Time Tracking'!$B$10:$T$19270,4,FALSE)","v":"00:00:00"},{"$f":"VLOOKUP($B12,'Time Tracking'!$B$10:$T$19270,5,FALSE)","v":"00:00:00"},{"$f":"VLOOKUP($B12,'Time Tracking'!$B$10:$T$19270,6,FALSE)","v":"00:00:00"},{"$f":"VLOOKUP($B12,'Time Tracking'!$B$10:$T$19270,7,FALSE)","v":"00:00:00"},{"$f":"VLOOKUP($B12,'Time Tracking'!$B$10:$T$19270,8,FALSE)","v":"00:00:00"},{"$f":"VLOOKUP($B12,'Time Tracking'!$B$10:$T$19270,13,FALSE)","v":0},{"$f":"VLOOKUP($B12,'Time Tracking'!$B$10:$T$19270,14,FALSE)","v":0},{"$f":"VLOOKUP($B12,'Time Tracking'!$B$10:$T$19270,15,FALSE)","v":0},{"$f":"VLOOKUP($B12,'Time Tracking'!$B$10:$T$19270,16,FALSE)","v":0},{"$f":"VLOOKUP($B12,'Time Tracking'!$B$10:$T$19270,17,FALSE)","v":0},{"$f":"VLOOKUP($B12,'Time Tracking'!$B$10:$T$19270,18,FALSE)","v":0}]
[{"$f":"VLOOKUP(B13,'Time Tracking'!$B$10:$C$19270,2)","v":"Saturday"},"2015-03-14",{"$f":"VLOOKUP($B13,'Time Tracking'!$B$10:$T$19270,3,FALSE)","v":"00:00:00"},{"$f":"VLOOKUP($B13,'Time Tracking'!$B$10:$T$19270,4,FALSE)","v":"00:00:00"},{"$f":"VLOOKUP($B13,'Time Tracking'!$B$10:$T$19270,5,FALSE)","v":"00:00:00"},{"$f":"VLOOKUP($B13,'Time Tracking'!$B$10:$T$19270,6,FALSE)","v":"00:00:00"},{"$f":"VLOOKUP($B13,'Time Tracking'!$B$10:$T$19270,7,FALSE)","v":"00:00:00"},{"$f":"VLOOKUP($B13,'Time Tracking'!$B$10:$T$19270,8,FALSE)","v":"00:00:00"},{"$f":"VLOOKUP($B13,'Time Tracking'!$B$10:$T$19270,13,FALSE)","v":0},{"$f":"VLOOKUP($B13,'Time Tracking'!$B$10:$T$19270,14,FALSE)","v":0},{"$f":"VLOOKUP($B13,'Time Tracking'!$B$10:$T$19270,15,FALSE)","v":0},{"$f":"VLOOKUP($B13,'Time Tracking'!$B$10:$T$19270,16,FALSE)","v":0},{"$f":"VLOOKUP($B13,'Time Tracking'!$B$10:$T$19270,17,FALSE)","v":0},{"$f":"VLOOKUP($B13,'Time Tracking'!$B$10:$T$19270,18,FALSE)","v":0}]
[{"$f":"VLOOKUP(B14,'Time Tracking'!$B$10:$C$19270,2)","v":"Sunday"},"2015-03-15",{"$f":"VLOOKUP($B14,'Time Tracking'!$B$10:$T$19270,3,FALSE)","v":"00:00:00"},{"$f":"VLOOKUP($B14,'Time Tracking'!$B$10:$T$19270,4,FALSE)","v":"00:00:00"},{"$f":"VLOOKUP($B14,'Time Tracking'!$B$10:$T$19270,5,FALSE)","v":"00:00:00"},{"$f":"VLOOKUP($B14,'Time Tracking'!$B$10:$T$19270,6,FALSE)","v":"00:00:00"},{"$f":"VLOOKUP($B14,'Time Tracking'!$B$10:$T$19270,7,FALSE)","v":"00:00:00"},{"$f":"VLOOKUP($B14,'Time Tracking'!$B$10:$T$19270,8,FALSE)","v":"00:00:00"},{"$f":"VLOOKUP($B14,'Time Tracking'!$B$10:$T$19270,13,FALSE)","v":0},{"$f":"VLOOKUP($B14,'Time Tracking'!$B$10:$T$19270,14,FALSE)","v":0},{"$f":"VLOOKUP($B14,'Time Tracking'!$B$10:$T$19270,15,FALSE)","v":0},{"$f":"VLOOKUP($B14,'Time Tracking'!$B$10:$T$19270,16,FALSE)","v":0},{"$f":"VLOOKUP($B14,'Time Tracking'!$B$10:$T$19270,17,FALSE)","v":0},{"$f":"VLOOKUP($B14,'Time Tracking'!$B$10:$T$19270,18,FALSE)","v":0}]
[{"$f":"VLOOKUP(B15,'Time Tracking'!$B$10:$C$19270,2)","v":"Monday"},"2015-03-16",{"$f":"VLOOKUP($B15,'Time Tracking'!$B$10:$T$19270,3,FALSE)","v":"00:00:00"},{"$f":"VLOOKUP($B15,'Time Tracking'!$B$10:$T$19270,4,FALSE)","v":"00:00:00"},{"$f":"VLOOKUP($B15,'Time Tracking'!$B$10:$T$19270,5,FALSE)","v":"00:00:00"},{"$f":"VLOOKUP($B15,'Time Tracking'!$B$10:$T$19270,6,FALSE)","v":"00:00:00"},{"$f":"VLOOKUP($B15,'Time Tracking'!$B$10:$T$19270,7,FALSE)","v":"00:00:00"},{"$f":"VLOOKUP($B15,'Time Tracking'!$B$10:$T$19270,8,FALSE)","v":"00:00:00"},{"$f":"VLOOKUP($B15,'Time Tracking'!$B$10:$T$19270,13,FALSE)","v":0},{"$f":"VLOOKUP($B15,'Time Tracking'!$B$10:$T$19270,14,FALSE)","v":0},{"$f":"VLOOKUP($B15,'Time Tracking'!$B$10:$T$19270,15,FALSE)","v":0},{"$f":"VLOOKUP($B15,'Time Tracking'!$B$10:$T$19270,16,FALSE)","v":0},{"$f":"VLOOKUP($B15,'Time Tracking'!$B$10:$T$19270,17,FALSE)","v":0},{"$f":"VLOOKUP($B15,'Time Tracking'!$B$10:$T$19270,18,FALSE)","v":0}]
[{"$f":"VLOOKUP(B16,'Time Tracking'!$B$10:$C$19270,2)","v":"Tuesday"},"2015-03-17",{"$f":"VLOOKUP($B16,'Time Tracking'!$B$10:$T$19270,3,FALSE)","v":"00:00:00"},{"$f":"VLOOKUP($B16,'Time Tracking'!$B$10:$T$19270,4,FALSE)","v":"00:00:00"},{"$f":"VLOOKUP($B16,'Time Tracking'!$B$10:$T$19270,5,FALSE)","v":"00:00:00"},{"$f":"VLOOKUP($B16,'Time Tracking'!$B$10:$T$19270,6,FALSE)","v":"00:00:00"},{"$f":"VLOOKUP($B16,'Time Tracking'!$B$10:$T$19270,7,FALSE)","v":"00:00:00"},{"$f":"VLOOKUP($B16,'Time Tracking'!$B$10:$T$19270,8,FALSE)","v":"00:00:00"},{"$f":"VLOOKUP($B16,'Time Tracking'!$B$10:$T$19270,13,FALSE)","v":0},{"$f":"VLOOKUP($B16,'Time Tracking'!$B$10:$T$19270,14,FALSE)","v":0},{"$f":"VLOOKUP($B16,'Time Tracking'!$B$10:$T$19270,15,FALSE)","v":0},{"$f":"VLOOKUP($B16,'Time Tracking'!$B$10:$T$19270,16,FALSE)","v":0},{"$f":"VLOOKUP($B16,'Time Tracking'!$B$10:$T$19270,17,FALSE)","v":0},{"$f":"VLOOKUP($B16,'Time Tracking'!$B$10:$T$19270,18,FALSE)","v":0}]
[{"$f":"VLOOKUP(B17,'Time Tracking'!$B$10:$C$19270,2)","v":"Wednesday"},"2015-03-18",{"$f":"VLOOKUP($B17,'Time Tracking'!$B$10:$T$19270,3,FALSE)","v":"00:00:00"},{"$f":"VLOOKUP($B17,'Time Tracking'!$B$10:$T$19270,4,FALSE)","v":"00:00:00"},{"$f":"VLOOKUP($B17,'Time Tracking'!$B$10:$T$19270,5,FALSE)","v":"00:00:00"},{"$f":"VLOOKUP($B17,'Time Tracking'!$B$10:$T$19270,6,FALSE)","v":"00:00:00"},{"$f":"VLOOKUP($B17,'Time Tracking'!$B$10:$T$19270,7,FALSE)","v":"00:00:00"},{"$f":"VLOOKUP($B17,'Time Tracking'!$B$10:$T$19270,8,FALSE)","v":"00:00:00"},{"$f":"VLOOKUP($B17,'Time Tracking'!$B$10:$T$19270,13,FALSE)","v":0},{"$f":"VLOOKUP($B17,'Time Tracking'!$B$10:$T$19270,14,FALSE)","v":0},{"$f":"VLOOKUP($B17,'Time Tracking'!$B$10:$T$19270,15,FALSE)","v":0},{"$f":"VLOOKUP($B17,'Time Tracking'!$B$10:$T$19270,16,FALSE)","v":0},{"$f":"VLOOKUP($B17,'Time Tracking'!$B$10:$T$19270,17,FALSE)","v":0},{"$f":"VLOOKUP($B17,'Time Tracking'!$B$10:$T$19270,18,FALSE)","v":0}]
[{"$f":"VLOOKUP(B18,'Time Tracking'!$B$10:$C$19270,2)","v":"Thursday"},"2015-03-19",{"$f":"VLOOKUP($B18,'Time Tracking'!$B$10:$T$19270,3,FALSE)","v":"00:00:00"},{"$f":"VLOOKUP($B18,'Time Tracking'!$B$10:$T$19270,4,FALSE)","v":"00:00:00"},{"$f":"VLOOKUP($B18,'Time Tracking'!$B$10:$T$19270,5,FALSE)","v":"00:00:00"},{"$f":"VLOOKUP($B18,'Time Tracking'!$B$10:$T$19270,6,FALSE)","v":"00:00:00"},{"$f":"VLOOKUP($B18,'Time Tracking'!$B$10:$T$19270,7,FALSE)","v":"00:00:00"},{"$f":"VLOOKUP($B18,'Time Tracking'!$B$10:$T$19270,8,FALSE)","v":"00:00:00"},{"$f":"VLOOKUP($B18,'Time Tracking'!$B$10:$T$19270,13,FALSE)","v":0},{"$f":"VLOOKUP($B18,'Time Tracking'!$B$10:$T$19270,14,FALSE)","v":0},{"$f":"VLOOKUP($B18,'Time Tracking'!$B$10:$T$19270,15,FALSE)","v":0},{"$f":"VLOOKUP($B18,'Time Tracking'!$B$10:$T$19270,16,FALSE)","v":0},{"$f":"VLOOKUP($B18,'Time Tracking'!$B$10:$T$19270,17,FALSE)","v":0},{"$f":"VLOOKUP($B18,'Time Tracking'!$B$10:$T$19270,18,FALSE)","v":0}]
[{"$f":"VLOOKUP(B19,'Time Tracking'!$B$10:$C$19270,2)","v":"Friday"},"2015-03-20",{"$f":"VLOOKUP($B19,'Time Tracking'!$B$10:$T$19270,3,FALSE)","v":"00:00:00"},{"$f":"VLOOKUP($B19,'Time Tracking'!$B$10:$T$19270,4,FALSE)","v":"00:00:00"},{"$f":"VLOOKUP($B19,'Time Tracking'!$B$10:$T$19270,5,FALSE)","v":"00:00:00"},{"$f":"VLOOKUP($B19,'Time Tracking'!$B$10:$T$19270,6,FALSE)","v":"00:00:00"},{"$f":"VLOOKUP($B19,'Time Tracking'!$B$10:$T$19270,7,FALSE)","v":"00:00:00"},{"$f":"VLOOKUP($B19,'Time Tracking'!$B$10:$T$19270,8,FALSE)","v":"00:00:00"},{"$f":"VLOOKUP($B19,'Time Tracking'!$B$10:$T$19270,13,FALSE)","v":0},{"$f":"VLOOKUP($B19,'Time Tracking'!$B$10:$T$19270,14,FALSE)","v":0},{"$f":"VLOOKUP($B19,'Time Tracking'!$B$10:$T$19270,15,FALSE)","v":0},{"$f":"VLOOKUP($B19,'Time Tracking'!$B$10:$T$19270,16,FALSE)","v":0},{"$f":"VLOOKUP($B19,'Time Tracking'!$B$10:$T$19270,17,FALSE)","v":0},{"$f":"VLOOKUP($B19,'Time Tracking'!$B$10:$T$19270,18,FALSE)","v":0}]
[{"$f":"VLOOKUP(B20,'Time Tracking'!$B$10:$C$19270,2)","v":"Saturday"},"2015-03-21",{"$f":"VLOOKUP($B20,'Time Tracking'!$B$10:$T$19270,3,FALSE)","v":"00:00:00"},{"$f":"VLOOKUP($B20,'Time Tracking'!$B$10:$T$19270,4,FALSE)","v":"00:00:00"},{"$f":"VLOOKUP($B20,'Time Tracking'!$B$10:$T$19270,5,FALSE)","v":"00:00:00"},{"$f":"VLOOKUP($B20,'Time Tracking'!$B$10:$T$19270,6,FALSE)","v":"00:00:00"},{"$f":"VLOOKUP($B20,'Time Tracking'!$B$10:$T$19270,7,FALSE)","v":"00:00:00"},{"$f":"VLOOKUP($B20,'Time Tracking'!$B$10:$T$19270,8,FALSE)","v":"00:00:00"},{"$f":"VLOOKUP($B20,'Time Tracking'!$B$10:$T$19270,13,FALSE)","v":0},{"$f":"VLOOKUP($B20,'Time Tracking'!$B$10:$T$19270,14,FALSE)","v":0},{"$f":"VLOOKUP($B20,'Time Tracking'!$B$10:$T$19270,15,FALSE)","v":0},{"$f":"VLOOKUP($B20,'Time Tracking'!$B$10:$T$19270,16,FALSE)","v":0},{"$f":"VLOOKUP($B20,'Time Tracking'!$B$10:$T$19270,17,FALSE)","v":0},{"$f":"VLOOKUP($B20,'Time Tracking'!$B$10:$T$19270,18,FALSE)","v":0}]
[{"$f":"VLOOKUP(B21,'Time Tracking'!$B$10:$C$19270,2)","v":"Sunday"},"2015-03-22",{"$f":"VLOOKUP($B21,'Time Tracking'!$B$10:$T$19270,3,FALSE)","v":"00:00:00"},{"$f":"VLOOKUP($B21,'Time Tracking'!$B$10:$T$19270,4,FALSE)","v":"00:00:00"},{"$f":"VLOOKUP($B21,'Time Tracking'!$B$10:$T$19270,5,FALSE)","v":"00:00:00"},{"$f":"VLOOKUP($B21,'Time Tracking'!$B$10:$T$19270,6,FALSE)","v":"00:00:00"},{"$f":"VLOOKUP($B21,'Time Tracking'!$B$10:$T$19270,7,FALSE)","v":"00:00:00"},{"$f":"VLOOKUP($B21,'Time Tracking'!$B$10:$T$19270,8,FALSE)","v":"00:00:00"},{"$f":"VLOOKUP($B21,'Time Tracking'!$B$10:$T$19270,13,FALSE)","v":0},{"$f":"VLOOKUP($B21,'Time Tracking'!$B$10:$T$19270,14,FALSE)","v":0},{"$f":"VLOOKUP($B21,'Time Tracking'!$B$10:$T$19270,15,FALSE)","v":0},{"$f":"VLOOKUP($B21,'Time Tracking'!$B$10:$T$19270,16,FALSE)","v":0},{"$f":"VLOOKUP($B21,'Time Tracking'!$B$10:$T$19270,17,FALSE)","v":0},{"$f":"VLOOKUP($B21,'Time Tracking'!$B$10:$T$19270,18,FALSE)","v":0}]
[{"$f":"VLOOKUP(B22,'Time Tracking'!$B$10:$C$19270,2)","v":"Monday"},"2015-03-23",{"$f":"VLOOKUP($B22,'Time Tracking'!$B$10:$T$19270,3,FALSE)","v":"00:00:00"},{"$f":"VLOOKUP($B22,'Time Tracking'!$B$10:$T$19270,4,FALSE)","v":"00:00:00"},{"$f":"VLOOKUP($B22,'Time Tracking'!$B$10:$T$19270,5,FALSE)","v":"00:00:00"},{"$f":"VLOOKUP($B22,'Time Tracking'!$B$10:$T$19270,6,FALSE)","v":"00:00:00"},{"$f":"VLOOKUP($B22,'Time Tracking'!$B$10:$T$19270,7,FALSE)","v":"00:00:00"},{"$f":"VLOOKUP($B22,'Time Tracking'!$B$10:$T$19270,8,FALSE)","v":"00:00:00"},{"$f":"VLOOKUP($B22,'Time Tracking'!$B$10:$T$19270,13,FALSE)","v":0},{"$f":"VLOOKUP($B22,'Time Tracking'!$B$10:$T$19270,14,FALSE)","v":0},{"$f":"VLOOKUP($B22,'Time Tracking'!$B$10:$T$19270,15,FALSE)","v":0},{"$f":"VLOOKUP($B22,'Time Tracking'!$B$10:$T$19270,16,FALSE)","v":0},{"$f":"VLOOKUP($B22,'Time Tracking'!$B$10:$T$19270,17,FALSE)","v":0},{"$f":"VLOOKUP($B22,'Time Tracking'!$B$10:$T$19270,18,FALSE)","v":0}]
[{"$f":"VLOOKUP(B23,'Time Tracking'!$B$10:$C$19270,2)","v":"Tuesday"},"2015-03-24",{"$f":"VLOOKUP($B23,'Time Tracking'!$B$10:$T$19270,3,FALSE)","v":"00:00:00"},{"$f":"VLOOKUP($B23,'Time Tracking'!$B$10:$T$19270,4,FALSE)","v":"00:00:00"},{"$f":"VLOOKUP($B23,'Time Tracking'!$B$10:$T$19270,5,FALSE)","v":"00:00:00"},{"$f":"VLOOKUP($B23,'Time Tracking'!$B$10:$T$19270,6,FALSE)","v":"00:00:00"},{"$f":"VLOOKUP($B23,'Time Tracking'!$B$10:$T$19270,7,FALSE)","v":"00:00:00"},{"$f":"VLOOKUP($B23,'Time Tracking'!$B$10:$T$19270,8,FALSE)","v":"00:00:00"},{"$f":"VLOOKUP($B23,'Time Tracking'!$B$10:$T$19270,13,FALSE)","v":0},{"$f":"VLOOKUP($B23,'Time Tracking'!$B$10:$T$19270,14,FALSE)","v":0},{"$f":"VLOOKUP($B23,'Time Tracking'!$B$10:$T$19270,15,FALSE)","v":0},{"$f":"VLOOKUP($B23,'Time Tracking'!$B$10:$T$19270,16,FALSE)","v":0},{"$f":"VLOOKUP($B23,'Time Tracking'!$B$10:$T$19270,17,FALSE)","v":0},{"$f":"VLOOKUP($B23,'Time Tracking'!$B$10:$T$19270,18,FALSE)","v":0}]
[{"$f":"VLOOKUP(B24,'Time Tracking'!$B$10:$C$19270,2)","v":"Wednesday"},"2015-03-25",{"$f":"VLOOKUP($B24,'Time Tracking'!$B$10:$T$19270,3,FALSE)","v":"00:00:00"},{"$f":"VLOOKUP($B24,'Time Tracking'!$B$10:$T$19270,4,FALSE)","v":"00:00:00"},{"$f":"VLOOKUP($B24,'Time Tracking'!$B$10:$T$19270,5,FALSE)","v":"00:00:00"},{"$f":"VLOOKUP($B24,'Time Tracking'!$B$10:$T$19270,6,FALSE)","v":"00:00:00"},{"$f":"VLOOKUP($B24,'Time Tracking'!$B$10:$T$19270,7,FALSE)","v":"00:00:00"},{"$f":"VLOOKUP($B24,'Time Tracking'!$B$10:$T$19270,8,FALSE)","v":"00:00:00"},{"$f":"VLOOKUP($B24,'Time Tracking'!$B$10:$T$19270,13,FALSE)","v":0},{"$f":"VLOOKUP($B24,'Time Tracking'!$B$10:$T$19270,14,FALSE)","v":0},{"$f":"VLOOKUP($B24,'Time Tracking'!$B$10:$T$19270,15,FALSE)","v":0},{"$f":"VLOOKUP($B24,'Time Tracking'!$B$10:$T$19270,16,FALSE)","v":0},{"$f":"VLOOKUP($B24,'Time Tracking'!$B$10:$T$19270,17,FALSE)","v":0},{"$f":"VLOOKUP($B24,'Time Tracking'!$B$10:$T$19270,18,FALSE)","v":0}]
[{"$f":"IF(ISERROR(VLOOKUP(B25,'Time Tracking'!$B$10:$C$19270,2)),\"\",(VLOOKUP(B25,'Time Tracking'!$B$10:$C$19270,2)))","v":""},{"$f":"IF(B24=E6,,(B24+1))","v":"00:00:00"},{"$f":"IF(ISERROR(VLOOKUP($B25,'Time Tracking'!$B$10:$T$19270,3,FALSE)),\"\",(VLOOKUP($B25,'Time Tracking'!$B$10:$T$19270,3,FALSE)))","v":""},{"$f":"IF(ISERROR(VLOOKUP($B25,'Time Tracking'!$B$10:$T$19270,4,FALSE)),\"\",(VLOOKUP($B25,'Time Tracking'!$B$10:$T$19270,4,FALSE)))","v":""},{"$f":"IF(ISERROR(VLOOKUP($B25,'Time Tracking'!$B$10:$T$19270,5,FALSE)),\"\",(VLOOKUP($B25,'Time Tracking'!$B$10:$T$19270,5,FALSE)))","v":""},{"$f":"IF(ISERROR(VLOOKUP($B25,'Time Tracking'!$B$10:$T$19270,6,FALSE)),\"\",(VLOOKUP($B25,'Time Tracking'!$B$10:$T$19270,6,FALSE)))","v":""},{"$f":"IF(ISERROR(VLOOKUP($B25,'Time Tracking'!$B$10:$T$19270,7,FALSE)),\"\",(VLOOKUP($B25,'Time Tracking'!$B$10:$T$19270,7,FALSE)))","v":""},{"$f":"IF(ISERROR(VLOOKUP($B25,'Time Tracking'!$B$10:$T$19270,8,FALSE)),\"\",(VLOOKUP($B25,'Time Tracking'!$B$10:$T$19270,8,FALSE)))","v":""},{"$f":"IF(ISERROR(VLOOKUP($B25,'Time Tracking'!$B$10:$T$19270,13,FALSE)),\"\",(VLOOKUP($B25,'Time Tracking'!$B$10:$T$19270,13,FALSE)))","v":""},{"$f":"IF(ISERROR(VLOOKUP($B25,'Time Tracking'!$B$10:$T$19270,14,FALSE)),\"\",(VLOOKUP($B25,'Time Tracking'!$B$10:$T$19270,14,FALSE)))","v":""},{"$f":"IF(ISERROR(VLOOKUP($B25,'Time Tracking'!$B$10:$T$19270,15,FALSE)),\"\",(VLOOKUP($B25,'Time Tracking'!$B$10:$T$19270,15,FALSE)))","v":""},{"$f":"IF(ISERROR(VLOOKUP($B25,'Time Tracking'!$B$10:$T$19270,16,FALSE)),\"\",(VLOOKUP($B25,'Time Tracking'!$B$10:$T$19270,16,FALSE)))","v":""},{"$f":"IF(ISERROR(VLOOKUP($B25,'Time Tracking'!$B$10:$T$19270,17,FALSE)),\"\",(VLOOKUP($B25,'Time Tracking'!$B$10:$T$19270,17,FALSE)))","v":""},{"$f":"IF(ISERROR(VLOOKUP($B25,'Time Tracking'!$B$10:$T$19270,18,FALSE)),\"\",(VLOOKUP($B25,'Time Tracking'!$B$10:$T$19270,18,FALSE)))","v":""},{"$f":"IF(ISERROR(VLOOKUP($B25,'Time Tracking'!$B$10:$T$19270,19,FALSE)),\"\",(VLOOKUP($B25,'Time Tracking'!$B$10:$T$19270,19,FALSE)))","v":""}]
[null,null,null,null,null,null,null,null,{"$f":"SUM(I10:I25)","v":0},0,0,0,0,0]
[]
[]
["Employee Signature:",null,null,null,null,null,null,null,null,null,null,null,"For PR Use Only"]
[null,null,null,null,null,null,null,null,null,null,null,null,"Reg hrs",{"$f":"+I26","v":0}]
{"$rows_left_out":6}
{"sheet":"Deadlines","index":3,"n_rows":49,"n_cols":2,"rows_kept":49,"cut":false,"hidden":false,"merged":[]}
["PayBegin","PayEnd"]
["2014-12-26","2015-01-10"]
[{"$f":"+B2+1","v":"2015-01-11"},{"$f":"+A3+14","v":"2015-01-25"}]
[{"$f":"+B3+1","v":"2015-01-26"},{"$f":"+A4+15","v":"2015-02-10"}]
["2015-02-11",{"$f":"+A5+14","v":"2015-02-25"}]
["2015-02-26",{"$f":"+A6+12","v":"2015-03-10"}]
["2015-03-11",{"$f":"+A7+14","v":"2015-03-25"}]
["2015-03-26",{"$f":"+A8+15","v":"2015-04-10"}]
["2015-04-11",{"$f":"+A9+14","v":"2015-04-25"}]
["2015-04-26","2015-05-10"]
["2015-05-11","2015-05-25"]
["2015-05-26",{"$f":"+A12+15","v":"2015-06-10"}]
["2015-06-11","2015-06-25"]
["2015-06-26","2015-07-10"]
["2015-07-11","2015-07-25"]
["2015-07-26",{"$f":"+A16+15","v":"2015-08-10"}]
["2015-08-11","2015-08-25"]
["2015-08-26",{"$f":"+A18+15","v":"2015-09-10"}]
["2015-09-11","2015-09-25"]
["2015-09-26","2015-10-10"]
["2015-10-11","2015-10-25"]
["2015-10-26",{"$f":"+A22+15","v":"2015-11-10"}]
["2015-11-11","2015-11-25"]
["2015-11-26","2015-12-10"]
["2015-12-11","2015-12-25"]
["2015-12-26",{"$f":"+A26+15","v":"2016-01-10"}]
["2016-01-11","2016-01-25"]
["2016-01-26",{"$f":"+A28+15","v":"2016-02-10"}]
["2016-02-11","2016-02-25"]
["2016-02-26",{"$f":"+A30+13","v":"2016-03-10"}]
{"$rows_left_out":19}